BDBM50495441 CHEMBL3108926
SMILES CN[C@@H](C)C(=O)N[C@H](C(=O)N1CCC[C@H]1C(=O)N[C@H]1[C@@H](CCc2ccccc12)OCC#C)C(C)(C)C
InChI Key InChIKey=ZCXPLHTWEZNUGW-ZNKILWFQSA-N
Data  2 IC50  1 EC50
  Tab Delimited (TSV)   2D SDfile   Computed 3D by Vconf -m prep SDfile
Find this compound or compounds like it in BindingDB:
Activity Spreadsheet -- Enzyme Inhibition Constant Data from BindingDB
Found 3 hits for monomerid = 50495441
TargetE3 ubiquitin-protein ligase XIAP(Homo sapiens (Human))
Astrazeneca
Curated by ChEMBL
LigandPNGBDBM50495441(CHEMBL3108926)
Affinity DataIC50:  1.31E+3nM. Assay description: Displacement of AbuRPFK-5FAM from GST-tagged XIAP BIR3 domain (N252 to E350) (unknown origin) after 20 mins by fluorescence polarization assay
Ligand InfoPC cidPC sid
In DepthDetails ArticlePubMed
TargetBaculoviral IAP repeat-containing protein 2(Homo sapiens (Human))
Astrazeneca
Curated by ChEMBL
LigandPNGBDBM50495441(CHEMBL3108926)
Affinity DataEC50: >370nM. Assay description: Binding affinity to cIAP1 in human MDA-MB-231 cells assessed as induction of protein degradation after 1 hr by ELISA
Ligand InfoPC cidPC sid
In DepthDetails ArticlePubMed
TargetBaculoviral IAP repeat-containing protein 2(Homo sapiens (Human))
Astrazeneca
Curated by ChEMBL
LigandPNGBDBM50495441(CHEMBL3108926)
Affinity DataIC50:  290nM. Assay description: Displacement of AbuRPFK-5FAM from GST-tagged cIAP1 BIR3 domain (L250 to G350) (unknown origin) after 20 mins by fluorescence polarization assay
Ligand InfoPC cidPC sid
In DepthDetails ArticlePubMed