BDBM50495469 CHEMBL3108953
SMILES Cl.N[C@H]1C[C@@H]1c1ccc(NC(=O)CCCNC(=O)c2ccc(O)c3ncccc23)cc1
InChI Key InChIKey=YZGFCPABVFIIST-VOMIJIAVSA-N
Data  7 IC50
  Tab Delimited (TSV)   2D SDfile   Computed 3D by Vconf -m prep SDfile
Find this compound or compounds like it in BindingDB:
Activity Spreadsheet -- Enzyme Inhibition Constant Data from BindingDB
Found 7 hits for monomerid = 50495469
TargetLysine-specific demethylase 3A(Homo sapiens (Human))
Sapienza University Of Rome
Curated by ChEMBL
LigandPNGBDBM50495469(CHEMBL3108953)
Affinity DataIC50:  1.20E+4nM. Assay description: Inhibition of recombinant JMJD1A (unknown origin) incubated for 15 mins prior to substrate addition by AlphaScreen method
Ligand InfoPC cidPC sid
In DepthDetails ArticlePubMed
TargetLysine-specific histone demethylase 1A(Homo sapiens (Human))
Sapienza University Of Rome
Curated by ChEMBL
LigandPNGBDBM50495469(CHEMBL3108953)
Affinity DataIC50: <1.00E+3nM. Assay description: Inhibition of human recombinant His-tagged LSD1 (171 to 836) assessed as hydrogen peroxide formation after 5 mins
Ligand InfoPC cidPC sid
In DepthDetails ArticlePubMed
TargetLysine-specific demethylase 5C(Homo sapiens (Human))
Sapienza University Of Rome
Curated by ChEMBL
LigandPNGBDBM50495469(CHEMBL3108953)
Affinity DataIC50:  3.50E+4nM. Assay description: Inhibition of recombinant JARID1C (unknown origin) incubated for 15 mins prior to substrate addition by AlphaScreen method
Ligand InfoPC cidPC sid
In DepthDetails ArticlePubMed
TargetLysine-specific demethylase 4C(Homo sapiens (Human))
Sapienza University Of Rome
Curated by ChEMBL
LigandPNGBDBM50495469(CHEMBL3108953)
Affinity DataIC50:  4.50E+3nM. Assay description: Inhibition of recombinant JMJD2C (unknown origin) incubated for 15 mins prior to substrate addition by AlphaScreen method
Ligand InfoPC cidPC sid
In DepthDetails ArticlePubMed
TargetLysine-specific demethylase 4E(Homo sapiens (Human))
Sapienza University Of Rome
Curated by ChEMBL
LigandPNGBDBM50495469(CHEMBL3108953)
Affinity DataIC50:  5.50E+3nM. Assay description: Inhibition of recombinant JMJD2E (unknown origin) incubated for 15 mins prior to substrate addition by AlphaScreen method
Ligand InfoPC cidPC sid
In DepthDetails ArticlePubMed
TargetLysine-specific demethylase 6B(Homo sapiens (Human))
Sapienza University Of Rome
Curated by ChEMBL
LigandPNGBDBM50495469(CHEMBL3108953)
Affinity DataIC50:  1.80E+4nM. Assay description: Inhibition of recombinant JMJD3 (unknown origin) incubated for 15 mins prior to substrate addition by AlphaScreen method
Ligand InfoPC cidPC sid
In DepthDetails ArticlePubMed
TargetLysine-specific demethylase 2A(Homo sapiens (Human))
Sapienza University Of Rome
Curated by ChEMBL
LigandPNGBDBM50495469(CHEMBL3108953)
Affinity DataIC50:  1.20E+4nM. Assay description: Inhibition of recombinant FBXL11 (unknown origin) incubated for 15 mins prior to substrate addition by AlphaScreen method
Ligand InfoPC cidPC sid
In DepthDetails ArticlePubMed