BDBM50497026 CHEMBL3233209
SMILES Cc1ccccc1C(=O)CSc1nc2nc(N)[nH]c(=O)c2[nH]1
InChI Key InChIKey=YXZULINHSYINAQ-UHFFFAOYSA-N
Data  1 IC50  1 Kd
PDB links: 1 PDB ID matches this monomer.
  Tab Delimited (TSV)   2D SDfile   Computed 3D by Vconf -m prep SDfile
Find this compound or compounds like it in BindingDB:
Activity Spreadsheet -- Enzyme Inhibition Constant Data from BindingDB
Found 2 hits for monomerid = 50497026
Target2-amino-4-hydroxy-6-hydroxymethyldihydropteridine pyrophosphokinase(Escherichia coli (strain K12))
St. Jude Children'S Research Hospital
Curated by ChEMBL
LigandPNGBDBM50497026(CHEMBL3233209)
Affinity DataKd:  1.89E+4nM. Assay description: Binding affinity to GST-tagged Escherichia coli HPPK expressed in Escherichia coli by SPR assay based alternative equilibrium affinity method in pres...
Ligand InfoPC cidPC sidPDB
Target2-amino-4-hydroxy-6-hydroxymethyldihydropteridine pyrophosphokinase(Escherichia coli (strain K12))
St. Jude Children'S Research Hospital
Curated by ChEMBL
LigandPNGBDBM50497026(CHEMBL3233209)
Affinity DataIC50:  2.43E+5nM. Assay description: Inhibition of GST-tagged Escherichia coli HPPK expressed in Escherichia coli using 6-hydroxymethyl-7,8-dihydropterin hydrochloride as substrate after...
Ligand InfoPC cidPC sidPDB