BDBM50497270 CHEMBL3347551
SMILES [H][C@@]12CC(C)(C)[C@@]([H])([C@H](CC(C)=C)N1Cc1cccs1)c1c(Br)cccc21
InChI Key InChIKey=GXTLCDIQINFHFF-ZJOUEHCJSA-N
Data  5 IC50
  Tab Delimited (TSV)   2D SDfile   Computed 3D by Vconf -m prep SDfile
Find this compound or compounds like it in BindingDB:
Activity Spreadsheet -- Enzyme Inhibition Constant Data from BindingDB
Found 5 hits for monomerid = 50497270
TargetNADPH oxidase 1(Homo sapiens (Human))
University Of Pittsburgh
Curated by ChEMBL
LigandPNGBDBM50497270(CHEMBL3347551)
Affinity DataIC50: >1.00E+5nM. Assay description: Inhibition of full length human NOX1 transfected in COS 22 cells assessed as inhibition of Phorbol 12-myristate 13-acetate-stimulated ROS generation ...
Ligand InfoPC cidPC sid
In DepthDetails ArticlePubMed
TargetCytochrome b-245 heavy chain(Homo sapiens (Human))
University Of Pittsburgh
Curated by ChEMBL
LigandPNGBDBM50497270(CHEMBL3347551)
Affinity DataIC50:  3.80E+4nM. Assay description: Inhibition of full length human NOX2 transfected in COS 22 cells assessed as inhibition of Phorbol 12-myristate 13-acetate-stimulated ROS generation ...
Ligand InfoPC cidPC sid
In DepthDetails ArticlePubMed
TargetCytochrome b-245 heavy chain(Homo sapiens (Human))
University Of Pittsburgh
Curated by ChEMBL
LigandPNGBDBM50497270(CHEMBL3347551)
Affinity DataIC50:  3.20E+4nM. Assay description: Inhibition of full length human NOX2 transfected in COS 22 cells assessed as inhibition of Phorbol 12-myristate 13-acetate-stimulated ROS generation ...
Ligand InfoPC cidPC sid
In DepthDetails ArticlePubMed
TargetCytochrome b-245 heavy chain(Homo sapiens (Human))
University Of Pittsburgh
Curated by ChEMBL
LigandPNGBDBM50497270(CHEMBL3347551)
Affinity DataIC50:  30nM. Assay description: Inhibition of full length human NOX2 transfected in COS 22 cells assessed as inhibition of lithium dodecyl sulphate-stimulated ROS generation preincu...
Ligand InfoPC cidPC sid
In DepthDetails ArticlePubMed
TargetNADPH oxidase 5(Homo sapiens (Human))
University Of Pittsburgh
Curated by ChEMBL
LigandPNGBDBM50497270(CHEMBL3347551)
Affinity DataIC50: >1.00E+5nM. Assay description: Inhibition of full length human NOX5 transfected in HEK cells assessed as inhibition of ionomycin-stimulated ROS generation by chemiluminescence assa...
Ligand InfoPC cidPC sid
In DepthDetails ArticlePubMed