BDBM50498986 CHEMBL3736121
SMILES CO[C@H]1CCN(C[C@H]1F)c1nccc(Nc2cc3n([C@H](C)C(F)(F)F)c(nc3cn2)[C@@H](C)O)n1
InChI Key InChIKey=BOPSHQJEVUOWPS-JXFSHQFZSA-N
Data  3 KI  3 IC50
  Tab Delimited (TSV)   2D SDfile   Computed 3D by Vconf -m prep SDfile
Find this compound or compounds like it in BindingDB:
Activity Spreadsheet -- Enzyme Inhibition Constant Data from BindingDB
Found 6 hits for monomerid = 50498986
TargetEpidermal growth factor receptor(Homo sapiens (Human))
Argenta Discovery
Curated by ChEMBL
LigandPNGBDBM50498986(CHEMBL3736121)
Affinity DataKi:  1.10nM. Assay description: Inhibition of human EGFR T790M/L858R double mutant using Fl-EEPLYWSFPAKKK-CONH2 as substrate preincubated for 30 mins followed by addition of substra...
Ligand InfoPC cidPC sid
In DepthDetails ArticlePubMed
TargetEpidermal growth factor receptor(Homo sapiens (Human))
Argenta Discovery
Curated by ChEMBL
LigandPNGBDBM50498986(CHEMBL3736121)
Affinity DataKi:  7nM. Assay description: Inhibition of human EGFR T790M/del (746 to 750) deletion mutant using Fl-EEPLYWSFPAKKK-CONH2 as substrate preincubated for 30 mins followed by additi...
Ligand InfoPC cidPC sid
In DepthDetails ArticlePubMed
TargetEpidermal growth factor receptor(Homo sapiens (Human))
Argenta Discovery
Curated by ChEMBL
LigandPNGBDBM50498986(CHEMBL3736121)
Affinity DataKi:  122nM. Assay description: Inhibition of human wild type EGFR using Fl-EEPLYWSFPAKKK-CONH2 as substrate preincubated for 30 mins followed by addition of substrate measured afte...
Ligand InfoPC cidPC sid
In DepthDetails ArticlePubMed
TargetEpidermal growth factor receptor(Homo sapiens (Human))
Argenta Discovery
Curated by ChEMBL
LigandPNGBDBM50498986(CHEMBL3736121)
Affinity DataIC50:  2.10E+4nM. Assay description: Inhibition of EGFR phosphorylation in human NCI-H1975 cells preincubated for 1 hr followed by stimulation with EGF for 8 mins by electrochemiluminesc...
Ligand InfoPC cidPC sid
In DepthDetails ArticlePubMed
TargetEpidermal growth factor receptor(Homo sapiens (Human))
Argenta Discovery
Curated by ChEMBL
LigandPNGBDBM50498986(CHEMBL3736121)
Affinity DataIC50:  27nM. Assay description: Inhibition of EGFR T790M/del (746 to 750) deletion mutant phosphorylation in erlotinib-resistant human PC9 cells preincubated for 1 hr followed by st...
Ligand InfoPC cidPC sid
In DepthDetails ArticlePubMed
TargetEpidermal growth factor receptor(Homo sapiens (Human))
Argenta Discovery
Curated by ChEMBL
LigandPNGBDBM50498986(CHEMBL3736121)
Affinity DataIC50: >1.00E+4nM. Assay description: Inhibition of EGFR phosphorylation in human NCI-H292 cells preincubated for 1 hr followed by stimulation with EGF for 8 mins by electrochemiluminesce...
Ligand InfoPC cidPC sid
In DepthDetails ArticlePubMed