BDBM50499255 CHEMBL3735008
SMILES Fc1ccc(cc1)-n1ncc2C[C@@]3(CN(CCC3=Cc12)S(=O)(=O)c1ccc(cc1)C(F)(F)F)C(=O)c1cscn1
InChI Key InChIKey=MCABQMUFDIVABH-SANMLTNESA-N
Data  2 KI
  Tab Delimited (TSV)   2D SDfile   Computed 3D by Vconf -m prep SDfile
Find this compound or compounds like it in BindingDB:
Activity Spreadsheet -- Enzyme Inhibition Constant Data from BindingDB
Found 2 hits for monomerid = 50499255
TargetGlucocorticoid receptor(Homo sapiens (Human))
Corcept Therapeutics
Curated by ChEMBL
LigandPNGBDBM50499255(CHEMBL3735008)
Affinity DataKi:  0.140nM. Assay description: Binding affinity to human recombinant glucocorticoid receptor by fluorescence polarization assay
Ligand InfoPC cidPC sid
In DepthDetails ArticlePubMed
TargetGlucocorticoid receptor(Homo sapiens (Human))
Corcept Therapeutics
Curated by ChEMBL
LigandPNGBDBM50499255(CHEMBL3735008)
Affinity DataKi:  22nM. Assay description: Antagonist activity at glucocorticoid receptor in human HepG2 cells assessed as inhibition of glucocorticoid-induced TAT activity after 24 hrs
Ligand InfoPC cidPC sid
In DepthDetails ArticlePubMed