BDBM50499938 CHEMBL3741390
SMILES [H][C@@]12CCCN1C(=O)c1ccccc1NC(=O)[C@H](Cc1ccccc1)NC(=O)[C@@H](C)NC(=O)[C@@H](Cc1ccccc1)N(C)C2=O
InChI Key InChIKey=DQANXPFOPIEFAD-KZNIJNHCSA-N
Data  1 IC50
  Tab Delimited (TSV)   2D SDfile   Computed 3D by Vconf -m prep SDfile
Find this compound or compounds like it in BindingDB:
Activity Spreadsheet -- Enzyme Inhibition Constant Data from BindingDB
Found 1 hit for monomerid = 50499938
TargetAccessory gene regulator protein A(Staphylococcus aureus)
Toyama Prefectural University
Curated by ChEMBL
LigandPNGBDBM50499938(CHEMBL3741390)
Affinity DataIC50:  4.40E+3nM. Assay description: Inhibition of agr-mediated quorum sensing in Staphylococcus aureus after 5 hrs by luminescence analysis
Ligand InfoPC cidPC sid
In DepthDetails ArticlePubMed