BDBM50499987 CHEMBL3742315
SMILES [H][C@]12[C@H](O)[C@](Oc3cc(O)c(C)c(OC)c13)(Oc1cc(OC)c3CC[C@H](Oc3c21)c1ccccc1)c1ccccc1
InChI Key InChIKey=VVMNOJJSVJYOFS-PAPLSHODSA-N
Data  1 KI  2 IC50
  Tab Delimited (TSV)   2D SDfile   Computed 3D by Vconf -m prep SDfile
Find this compound or compounds like it in BindingDB:
Activity Spreadsheet -- Enzyme Inhibition Constant Data from BindingDB
Found 3 hits for monomerid = 50499987
TargetPancreatic alpha-amylase(Sus scrofa (Pig))
National University Of Singapore
Curated by ChEMBL
LigandPNGBDBM50499987(CHEMBL3742315)
Affinity DataKi:  1.17E+4nM. Assay description: Non-competitive inhibition of porcine pancreatic alpha-amylase by Lineweaver-Burk plot analysis
In DepthDetails ArticlePubMed
TargetPancreatic alpha-amylase(Sus scrofa (Pig))
National University Of Singapore
Curated by ChEMBL
LigandPNGBDBM50499987(CHEMBL3742315)
Affinity DataIC50:  2.70E+4nM. Assay description: Inhibition of porcine pancreatic alpha-amylase assessed as starch digestion up to 120 mins by turbidity assay
In DepthDetails ArticlePubMed
TargetAlpha-amylase(Bacillus subtilis (strain 168))
National University Of Singapore
Curated by ChEMBL
LigandPNGBDBM50499987(CHEMBL3742315)
Affinity DataIC50:  4.20E+4nM. Assay description: Inhibition of Bacillus subtilis alpha-amylase
In DepthDetails ArticlePubMed