BDBM50499996 CHEMBL3740019
SMILES Cc1ccc(cc1)N1CCN(CCc2ccc(CN3C(=O)c4ccccc4C3=O)cc2)CC1
InChI Key InChIKey=XCHXGNJKMSFNTQ-UHFFFAOYSA-N
Data  3 IC50
  Tab Delimited (TSV)   2D SDfile   Computed 3D by Vconf -m prep SDfile
Find this compound or compounds like it in BindingDB:
Activity Spreadsheet -- Enzyme Inhibition Constant Data from BindingDB
Found 3 hits for monomerid = 50499996
TargetAlpha-1D adrenergic receptor(Homo sapiens (Human))
Jinan University
Curated by ChEMBL
LigandPNGBDBM50499996(CHEMBL3740019)
Affinity DataIC50:  344nM. Assay description: Antagonist activity at adrenergic alpha1D receptor (unknown origin) by firefly and renilla dual glo luciferase assay
Ligand InfoPC cidPC sid
In DepthDetails ArticlePubMed
TargetAlpha-1A adrenergic receptor(Homo sapiens (Human))
Jinan University
Curated by ChEMBL
LigandPNGBDBM50499996(CHEMBL3740019)
Affinity DataIC50:  2nM. Assay description: Antagonist activity at adrenergic alpha1A receptor (unknown origin) by firefly and renilla dual glo luciferase assay
Ligand InfoPC cidPC sid
In DepthDetails ArticlePubMed
TargetAlpha-1B adrenergic receptor(Homo sapiens (Human))
Jinan University
Curated by ChEMBL
LigandPNGBDBM50499996(CHEMBL3740019)
Affinity DataIC50:  29nM. Assay description: Antagonist activity at adrenergic alpha1B receptor (unknown origin) by firefly and renilla dual glo luciferase assay
Ligand InfoPC cidPC sid
In DepthDetails ArticlePubMed