BDBM50500123 CHEMBL3746512
SMILES [H][C@]12C[C@]1([C@@H](O)[C@@H](O)[C@@H]2n1cnc2c(NCCc3ccccc3)nc(I)nc12)C(=O)NC
InChI Key InChIKey=DILMSJYJOSOLCR-DYRGRVSNSA-N
Data  5 KI
  Tab Delimited (TSV)   2D SDfile   Computed 3D by Vconf -m prep SDfile
Find this compound or compounds like it in BindingDB:
Activity Spreadsheet -- Enzyme Inhibition Constant Data from BindingDB
Found 5 hits for monomerid = 50500123
TargetTransmembrane domain-containing protein TMIGD3(Homo sapiens (Human))
National Institute Of Diabetes And Digestive And Kidney Diseases
Curated by ChEMBL
LigandPNGBDBM50500123(CHEMBL3746512)
Affinity DataKi:  0.910nM. Assay description: Displacement of [125I]N6-(4-amino-3-iodobenzyl)adenosine-5'-N-methyl-uronamide from human adenosine A3 receptor stably expressed in CHO cell membrane...
Ligand InfoPC cidPC sid
In DepthDetails ArticlePubMed
TargetAdenosine receptor A3(Mus musculus)
National Institute Of Diabetes And Digestive And Kidney Disease
Curated by ChEMBL
LigandPNGBDBM50500123(CHEMBL3746512)
Affinity DataKi:  1.70nM. Assay description: Displacement of [125I] N6-4-amino-3-iodobenzyl adenosine 5-N-methyluronamide from mouse A3A receptor stably expressed in HEK293 cell membrane by radi...
Ligand InfoPC cidPC sid
In DepthDetails PubMed
TargetAdenosine receptor A3(Homo sapiens (Human))
National Institute Of Diabetes And Digestive And Kidney Disease
Curated by ChEMBL
LigandPNGBDBM50500123(CHEMBL3746512)
Affinity DataKi:  4.5nM. Assay description: Displacement of [125I] N6-(4-amino-3-iodobenzyl)adenosine-5'-N-methyluronamide from human A3A receptor stably expressed in HEK293 cell membrane by ra...
Ligand InfoPC cidPC sid
In DepthDetails PubMed
TargetAdenosine receptor A1(Mus musculus)
National Institute Of Diabetes And Digestive And Kidney Disease
Curated by ChEMBL
LigandPNGBDBM50500123(CHEMBL3746512)
Affinity DataKi:  272nM. Assay description: Displacement of [3H] N6-R-phenylisopropyladenosine from mouse A1A receptor stably expressed in HEK293 cell membrane by radioligand inhibition assay
Ligand InfoPC cidPC sid
In DepthDetails PubMed
TargetAdenosine receptor A1(Homo sapiens (Human))
National Institute Of Diabetes And Digestive And Kidney Disease
Curated by ChEMBL
LigandPNGBDBM50500123(CHEMBL3746512)
Affinity DataKi:  574nM. Assay description: Displacement of [3H] N6-R-phenylisopropyladenosine from human A1A receptor stably expressed in HEK293 cell membrane by radioligand inhibition assay
Ligand InfoPC cidPC sid
In DepthDetails PubMed