BDBM50500929 CHEMBL3800231
SMILES COCCN(Cc1cc(cc2c1oc(cc2=O)N1CCO[C@H](C)C1)C(=O)N(C)C)c1cc(F)cc(F)c1
InChI Key InChIKey=ODXMHNGQPZYRBV-QGZVFWFLSA-N
Data  1 IC50
  Tab Delimited (TSV)   2D SDfile   Computed 3D by Vconf -m prep SDfile
Find this compound or compounds like it in BindingDB:
Activity Spreadsheet -- Enzyme Inhibition Constant Data from BindingDB
Found 1 hit for monomerid = 50500929
LigandPNGBDBM50500929(CHEMBL3800231)
Affinity DataIC50:  5nM. Assay description: Inhibition of PI3Kbeta in PTEN deficient human MDA-MB-468 cells assessed as inhibition of AKT phosphorylation at Ser-473 residue after 2 hrs by plate...
Ligand InfoPC cidPC sid
In DepthDetails ArticlePubMed