BDBM50501179 CHEMBL3930870
SMILES Oc1ccc(\C=N\NC(=O)CCc2ccc(F)cc2)c(O)c1O
InChI Key InChIKey=JEQRBHYJOGFFFE-GIJQJNRQSA-N
Data  1 IC50
  Tab Delimited (TSV)   2D SDfile   Computed 3D by Vconf -m prep SDfile
Find this compound or compounds like it in BindingDB:
Activity Spreadsheet -- Enzyme Inhibition Constant Data from BindingDB
Found 1 hit for monomerid = 50501179
TargetGenome polyprotein(Coxsackievirus B3 (strain Nancy))
Gwangju Institute Of Science And Technology (Gist)
Curated by ChEMBL
LigandPNGBDBM50501179(CHEMBL3930870)
Affinity DataIC50:  580nM. Assay description: Inhibition of recombinant Coxsackievirus B3 3C protease expressed in Escherichia coli BL21 (DE3) preincubated for 5 mins followed by addition of NMA-...
Ligand InfoPC cidPC sid
In DepthDetails ArticlePubMed