BDBM50501403 CHEMBL4084645
SMILES Nc1nc(N)c(C#N)c(N[C@@H](C2CC2)c2nc3cccc(Cl)c3c(=O)n2-c2cc[nH]n2)n1
InChI Key InChIKey=YMHCSLZTNCXUIU-HNNXBMFYSA-N
Data  4 IC50
  Tab Delimited (TSV)   2D SDfile   Computed 3D by Vconf -m prep SDfile
Find this compound or compounds like it in BindingDB:
Activity Spreadsheet -- Enzyme Inhibition Constant Data from BindingDB
Found 4 hits for monomerid = 50501403
LigandPNGBDBM50501403(CHEMBL4084645)
Affinity DataIC50:  0.600nM. Assay description: Inhibition of human full length PI3K p110delta/p85 alpha using PIP2/ATP as substrate after 30 mins by TR-FRET assay
Ligand InfoPC cidPC sid
In DepthDetails ArticlePubMed
LigandPNGBDBM50501403(CHEMBL4084645)
Affinity DataIC50:  199nM. Assay description: Inhibition of human full length PI3Kgamma using PIP2/ATP as substrate after 30 mins by TR-FRET assay
Ligand InfoPC cidPC sid
In DepthDetails ArticlePubMed
LigandPNGBDBM50501403(CHEMBL4084645)
Affinity DataIC50:  89nM. Assay description: Inhibition of human full length PI3K p110alpha/p85 alpha using PIP2/ATP as substrate after 30 mins by TR-FRET assay
Ligand InfoPC cidPC sid
In DepthDetails ArticlePubMed
LigandPNGBDBM50501403(CHEMBL4084645)
Affinity DataIC50:  1.60nM. Assay description: Inhibition of N-terminal His6-tagged recombinant full-length human PI3K p110beta/untagged recombinant full length human p85alpha expressed in baculov...
Ligand InfoPC cidPC sid
In DepthDetails ArticlePubMed