BDBM50502197 CHEMBL4549180
SMILES CN(C)c1ccc(cc1)C(Nc1ccc(Oc2ccc(NC(c3ccc(cc3)N(C)C)n3nc(oc3=S)-c3cc4ccccc4oc3=O)cc2)cc1)n1nc(oc1=S)-c1cc2ccccc2oc1=O
InChI Key InChIKey=NHRVZBQDFATMFT-UHFFFAOYSA-N
Data  1 IC50
  Tab Delimited (TSV)   2D SDfile   Computed 3D by Vconf -m prep SDfile
Find this compound or compounds like it in BindingDB:
Activity Spreadsheet -- Enzyme Inhibition Constant Data from BindingDB
Found 1 hit for monomerid = 50502197
TargetProbable maltase-glucoamylase 2(Homo sapiens)
Babasaheb Bhimrao Ambedkar University (A Central University)
Curated by ChEMBL
LigandPNGBDBM50502197(CHEMBL4549180)
Affinity DataIC50:  70nM. Assay description: Inhibition of alpha-glucosidase (unknown origin) using p-nitro phenyl glucopyranoside as substrate preincubated for 5 mins followed by substrate addi...
Ligand InfoPC cidPC sid
In DepthDetails ArticlePubMed