BDBM50502685 CHEMBL4517051
SMILES CN1C2N(CCCC2(O)c2ccccc12)C(=O)c1cccc(F)c1
InChI Key InChIKey=NOXMJWDRKYZBLM-UHFFFAOYSA-N
Data  1 IC50
  Tab Delimited (TSV)   2D SDfile   Computed 3D by Vconf -m prep SDfile
Find this compound or compounds like it in BindingDB:
Activity Spreadsheet -- Enzyme Inhibition Constant Data from BindingDB
Found 1 hit for monomerid = 50502685
TargetAcetylcholinesterase(Electrophorus electricus (Electric eel))
Jiangsu University Of Science And Technology
Curated by ChEMBL
LigandPNGBDBM50502685(CHEMBL4517051)
Affinity DataIC50:  337nM. Assay description: Inhibition of electric eel AChE by Ellman's colorimetry
Ligand InfoPC cidPC sid
In DepthDetails ArticlePubMed