BDBM50502691 CHEMBL4457242
SMILES CN1C2N(CCCC2(O)c2ccccc12)C(C)=O
InChI Key InChIKey=GOWFDSSFDPDJJY-UHFFFAOYSA-N
Data  1 IC50
  Tab Delimited (TSV)   2D SDfile   Computed 3D by Vconf -m prep SDfile
Find this compound or compounds like it in BindingDB:
Activity Spreadsheet -- Enzyme Inhibition Constant Data from BindingDB
Found 1 hit for monomerid = 50502691
TargetAcetylcholinesterase(Electrophorus electricus (Electric eel))
Jiangsu University Of Science And Technology
Curated by ChEMBL
LigandPNGBDBM50502691(CHEMBL4457242)
Affinity DataIC50:  1.21E+3nM. Assay description: Inhibition of electric eel AChE by Ellman's colorimetry
Ligand InfoPC cidPC sid
In DepthDetails ArticlePubMed