BDBM50502701 CHEMBL4435785
SMILES Cc1cccc(CN2C3N(CCC3(Cc3cccc(C)c3)c3ccccc23)C(=O)CCc2ccccc2)c1
InChI Key InChIKey=ZVEPGPONICQHPH-UHFFFAOYSA-N
Data  1 IC50
  Tab Delimited (TSV)   2D SDfile   Computed 3D by Vconf -m prep SDfile
Find this compound or compounds like it in BindingDB:
Activity Spreadsheet -- Enzyme Inhibition Constant Data from BindingDB
Found 1 hit for monomerid = 50502701
TargetAcetylcholinesterase(Electrophorus electricus (Electric eel))
Jiangsu University Of Science And Technology
Curated by ChEMBL
LigandPNGBDBM50502701(CHEMBL4435785)
Affinity DataIC50:  3.99nM. Assay description: Inhibition of electric eel AChE by Ellman's colorimetry
Ligand InfoPC cidPC sid
In DepthDetails ArticlePubMed