BDBM50502824 CHEMBL4471896
SMILES CC(C)C[C@H](N[C@H](c1ccccc1)C(F)(F)F)C(=O)NC1(CC1)C#N
InChI Key InChIKey=UXYWRPKODJHGIP-LSDHHAIUSA-N
Data  2 KI
  Tab Delimited (TSV)   2D SDfile   Computed 3D by Vconf -m prep SDfile
Find this compound or compounds like it in BindingDB:
Activity Spreadsheet -- Enzyme Inhibition Constant Data from BindingDB
Found 2 hits for monomerid = 50502824
TargetCruzipain(Trypanosoma cruzi)
Universidade De S£O Paulo
Curated by ChEMBL
LigandPNGBDBM50502824(CHEMBL4471896)
Affinity DataKi:  142nM. Assay description: Inhibition of Trypanosoma cruzi cruzain assessed as inhibitor constant using Z-Phe-Arg-7-amido-4-methylcoumarin as substrate preincubated for 2 mins ...
Ligand InfoPC cidPC sid
In DepthDetails ArticlePubMed
TargetCruzipain(Trypanosoma cruzi)
Universidade De S£O Paulo
Curated by ChEMBL
LigandPNGBDBM50502824(CHEMBL4471896)
Affinity DataKi:  200nM. Assay description: Inhibition of Trypanosoma cruzi cruzain using Z-Phe-Arg-7-amido-4-methylcoumarin as substrate preincubated for 2 mins followed by susbtrate addition ...
Ligand InfoPC cidPC sid
In DepthDetails ArticlePubMed