BDBM50504062 CHEMBL4439019
SMILES COc1ccc(Nc2cccc(c2)C(O)=O)c2ccccc12
InChI Key InChIKey=MPWMSFDFMVICHE-UHFFFAOYSA-N
Data  1 KI
  Tab Delimited (TSV)   2D SDfile   Computed 3D by Vconf -m prep SDfile
Find this compound or compounds like it in BindingDB:
Activity Spreadsheet -- Enzyme Inhibition Constant Data from BindingDB
Found 1 hit for monomerid = 50504062
TargetM-phase inducer phosphatase 2(Homo sapiens (Human))
University Of Naples Federico Ii
Curated by ChEMBL
LigandPNGBDBM50504062(CHEMBL4439019)
Affinity DataKi:  4.50E+4nM. Assay description: Uncompetitive inhibition of N-terminal His6-tagged human CDC25B (377 to 550 residues) expressed in Escherichia coli BL21(DE3) cells using OMFP as sub...
Ligand InfoPC cidPC sid
In DepthDetails ArticlePubMed