BDBM50507447 CHEMBL4456598
SMILES CN1CCC[C@H]1COc1nc2CN(CCc2c(n1)N1CCN(CC1)C(=O)C=C)c1cc(O)cc2ccccc12
InChI Key InChIKey=GQSSXKRUKAMOQS-QFIPXVFZSA-N
Data  6 IC50
  Tab Delimited (TSV)   2D SDfile   Computed 3D by Vconf -m prep SDfile
Find this compound or compounds like it in BindingDB:
Activity Spreadsheet -- Enzyme Inhibition Constant Data from BindingDB
Found 6 hits for monomerid = 50507447
TargetGTPase KRas(Homo sapiens (Human))
Array Biopharma
Curated by ChEMBL
LigandPNGBDBM50507447(CHEMBL4456598)
Affinity DataIC50:  48nM. Assay description: Inhibition of KRAS G12C mutant in human MIAPaCa2 cells assessed as reduction in ERK phosphorylation measured after 3 hrs by Western blot analysis
In DepthDetails ArticlePubMed
TargetGTPase KRas(Homo sapiens (Human))
Array Biopharma
Curated by ChEMBL
LigandPNGBDBM50507447(CHEMBL4456598)
Affinity DataIC50: >1.60E+4nM. Assay description: Inhibition of wild type KRAS in human RKO cells assessed as reduction in ERK phosphorylation measured after 3 hrs by Western blot analysis
In DepthDetails ArticlePubMed
TargetGTPase KRas(Homo sapiens (Human))
Array Biopharma
Curated by ChEMBL
LigandPNGBDBM50507447(CHEMBL4456598)
Affinity DataIC50:  142nM. Assay description: Inhibition of KRAS G12C mutant in human NCI-H358 cells assessed as reduction in ERK phosphorylation incubated for 3 hrs by in-cell western method
In DepthDetails ArticlePubMed
TargetGTPase KRas(Homo sapiens (Human))
Array Biopharma
Curated by ChEMBL
LigandPNGBDBM50507447(CHEMBL4456598)
Affinity DataIC50: >1.60E+4nM. Assay description: Inhibition of KRAS G12D mutant in human AGS cells assessed as reduction in ERK phosphorylation measured after 3 hrs by Western blot analysis
In DepthDetails ArticlePubMed
TargetGTPase KRas(Homo sapiens (Human))
Array Biopharma
Curated by ChEMBL
LigandPNGBDBM50507447(CHEMBL4456598)
Affinity DataIC50:  70nM. Assay description: Inhibition of KRAS G12C mutant in human NCI-H358 cells assessed as reduction in ERK phosphorylation measured after 3 hrs by Western blot analysis
In DepthDetails ArticlePubMed
TargetGTPase KRas(Homo sapiens (Human))
Array Biopharma
Curated by ChEMBL
LigandPNGBDBM50507447(CHEMBL4456598)
Affinity DataIC50: >1.60E+4nM. Assay description: Inhibition of wild type KRAS in human SNUC5 cells assessed as reduction in ERK phosphorylation measured after 3 hrs by Western blot analysis
In DepthDetails ArticlePubMed