BDBM50507942 CHEMBL4527281
SMILES COc1ccc(O)cc1-c1ccccc1O[C@@H]1O[C@H](CO)[C@H](O)[C@H](O)[C@H]1NC(C)=O
InChI Key InChIKey=DADHMTNJWRVFAB-YMQHIKHWSA-N
Data  1 IC50
  Tab Delimited (TSV)   2D SDfile   Computed 3D by Vconf -m prep SDfile
Find this compound or compounds like it in BindingDB:
Activity Spreadsheet -- Enzyme Inhibition Constant Data from BindingDB
Found 1 hit for monomerid = 50507942
TargetType 1 fimbrin D-mannose specific adhesin(Escherichia coli (strain K12))
Washington University School Of Medicine
Curated by ChEMBL
LigandPNGBDBM50507942(CHEMBL4527281)
Affinity DataIC50:  510nM. Assay description: Inhibition of Escherichia coli C-terminal 6x-His-tagged biotinylated FmlH lectin domain expressed in Escherichia coli periplasm assessed as reduction...
Ligand InfoKEGGPC cidPC sid
In DepthDetails ArticlePubMed