BDBM50508923 CHEBI:49703::LATRUNCULIN B::NSC-339663
SMILES [H][C@]1(CSC(=O)N1)[C@@]1(O)C[C@@]2([H])C[C@@]([H])(CC[C@H](C)\C=C/CC\C(C)=C/C(=O)O2)O1
InChI Key InChIKey=NSHPHXHGRHSMIK-JRIKCGFMSA-N
Data  1 IC50
PDB links: 26 PDB IDs match this monomer.
  Tab Delimited (TSV)   2D SDfile   Computed 3D by Vconf -m prep SDfile
Find this compound or compounds like it in BindingDB:
Activity Spreadsheet -- Enzyme Inhibition Constant Data from BindingDB
Found 1 hit for monomerid = 50508923
TargetActin, alpha skeletal muscle(Oryctolagus cuniculus)
Ludwig-Maximilians-University
Curated by ChEMBL
LigandPNGBDBM50508923(CHEBI:49703 | LATRUNCULIN B | NSC-339663)
Affinity DataIC50:  8.47E+3nM. Assay description: Inhibition of rabbit skeletal muscle alpha-actin polymerization measured after 24 hrs in presence of ATP and fluorescent pyrene-labelled actin by flu...