BDBM50509387 CHEMBL4475066
SMILES CC(=O)\C=C\[C@H](CCc1ccccc1)NC(=O)[C@H](Cc1ccccc1)NC(=O)c1ccc(F)cc1
InChI Key InChIKey=GJMFJSMWCBYWQN-MOKQZDJKSA-N
Data  2 KI
  Tab Delimited (TSV)   2D SDfile   Computed 3D by Vconf -m prep SDfile
Find this compound or compounds like it in BindingDB:
Activity Spreadsheet -- Enzyme Inhibition Constant Data from BindingDB
Found 2 hits for monomerid = 50509387
TargetCysteine protease(Trypanosoma brucei rhodesiense)
University Of Messina
Curated by ChEMBL
LigandPNGBDBM50509387(CHEMBL4475066)
Affinity DataKi:  0.00110nM. Assay description: Inhibition of Trypanosoma brucei rhodesiense rhodesain expressed in Pichia pastoris assessed as inhibition constant measured for 30 mins using Cbz-Ph...
Ligand InfoPC cidPC sid
In DepthDetails ArticlePubMed
TargetProcathepsin L(Homo sapiens (Human))
University Of Messina
Curated by ChEMBL
LigandPNGBDBM50509387(CHEMBL4475066)
Affinity DataKi:  1.5nM. Assay description: Inhibition of human Cathepsin L assessed as inhibition constant using Cbz-Phe-Arg-AMC as substrate by fluorescence assay
Ligand InfoPC cidPC sid
In DepthDetails ArticlePubMed