BDBM50510048 CHEMBL4442568
SMILES Cc1nn(c(C)c1-c1ccc(F)cc1)-c1ncnc2CNCc12
InChI Key InChIKey=VVJISDCXPCMGDZ-UHFFFAOYSA-N
Data  5 IC50
  Tab Delimited (TSV)   2D SDfile   Computed 3D by Vconf -m prep SDfile
Find this compound or compounds like it in BindingDB:
Activity Spreadsheet -- Enzyme Inhibition Constant Data from BindingDB
Found 5 hits for monomerid = 50510048
TargetAcid-sensing ion channel 1(Mus musculus)
Promidis
Curated by ChEMBL
LigandPNGBDBM50510048(CHEMBL4442568)
Affinity DataIC50: >3.00E+4nM. Assay description: Inhibition of pH 6.6-stimulated mouse ASIC1a homomer expressed in CHOK1 cells assessed as reduction in channel activation by VSD fluorescence assay
Ligand InfoPC cidPC sid
In DepthDetails ArticlePubMed
TargetAcid-sensing ion channel 2(Mus musculus)
Promidis
Curated by ChEMBL
LigandPNGBDBM50510048(CHEMBL4442568)
Affinity DataIC50:  1.70E+4nM. Assay description: Inhibition of pH 5.5-stimulated mouse ASIC2a homomer expressed in CHOK1 cells assessed as reduction in channel activation by VSD fluorescence assay
Ligand InfoPC cidPC sid
In DepthDetails ArticlePubMed
TargetAcid-sensing ion channel 2(Mus musculus)
Promidis
Curated by ChEMBL
LigandPNGBDBM50510048(CHEMBL4442568)
Affinity DataIC50: >3.00E+4nM. Assay description: Inhibition of pH 6.25-stimulated mouse ASIC1a/2a heterodimer expressed in CHOK1 cells assessed as reduction in channel activation by VSD fluorescence...
Ligand InfoPC cidPC sid
In DepthDetails ArticlePubMed
TargetCytochrome P450 1A2(Homo sapiens (Human))
Promidis
Curated by ChEMBL
LigandPNGBDBM50510048(CHEMBL4442568)
Affinity DataIC50:  800nM. Assay description: Inhibition of CYP1A2 (unknown origin) using pro-luciferin substrates in presence of NADPH by firefly luciferase reporter gene based P450-Glo assay
Ligand InfoPC cidPC sid
In DepthDetails ArticlePubMed
TargetPotassium voltage-gated channel subfamily H member 2(Homo sapiens (Human))
Promidis
Curated by ChEMBL
LigandPNGBDBM50510048(CHEMBL4442568)
Affinity DataIC50: >3.00E+4nM. Assay description: Inhibition of human ERG incubated for 4 hrs by fluorescence polarization assay
Ligand InfoPC cidPC sid
In DepthDetails ArticlePubMed