BDBM50510869 CHEMBL4443426
SMILES O=C(CCCCNc1c2CCCCc2nc2ccccc12)NCCc1c[nH]c2ccccc12
InChI Key InChIKey=MITMPSIUPHDEEX-UHFFFAOYSA-N
Data  1 IC50
  Tab Delimited (TSV)   2D SDfile   Computed 3D by Vconf -m prep SDfile
Find this compound or compounds like it in BindingDB:
Activity Spreadsheet -- Enzyme Inhibition Constant Data from BindingDB
Found 1 hit for monomerid = 50510869
TargetAcetylcholinesterase(Homo sapiens (Human))
Csir-Central Drug Research Institute
Curated by ChEMBL
LigandPNGBDBM50510869(CHEMBL4443426)
Affinity DataIC50:  0nM. Assay description: Inhibition of human erythrocyte acetylcholinesterase using acetylthiocholine as substrate by Ellman's method
Ligand InfoPC cidPC sid
In DepthDetails ArticlePubMed