BDBM50511300 CHEMBL4580541
SMILES O=C(NCCCCc1ccccc1)n1c2ccncc2oc1=O
InChI Key InChIKey=XHBAHKNDVPEWPK-UHFFFAOYSA-N
Data  1 IC50
  Tab Delimited (TSV)   2D SDfile   Computed 3D by Vconf -m prep SDfile
Find this compound or compounds like it in BindingDB:
Activity Spreadsheet -- Enzyme Inhibition Constant Data from BindingDB
Found 1 hit for monomerid = 50511300
TargetAcid ceramidase(Homo sapiens (Human))
University Of Illinois At Chicago
Curated by ChEMBL
LigandPNGBDBM50511300(CHEMBL4580541)
Affinity DataIC50:  3nM. Assay description: Inhibition of human acid ceramidase expressed in HEK293 cells using Rbm14-12 as substrate preincubated for 10 mins followed by substrate addition and...
Ligand InfoPC cidPC sid
In DepthDetails ArticlePubMed