BDBM50511671 CHEMBL4566202
SMILES CNC(CCCCB(O)O)(CNC(N)=N)C(O)=O
InChI Key InChIKey=MVIMWRYDBUFVPU-UHFFFAOYSA-N
Data  1 IC50
  Tab Delimited (TSV)   2D SDfile   Computed 3D by Vconf -m prep SDfile
Find this compound or compounds like it in BindingDB:
Activity Spreadsheet -- Enzyme Inhibition Constant Data from BindingDB
Found 1 hit for monomerid = 50511671
TargetArginase-1(Homo sapiens (Human))
Oncoarendi Therapeutics
Curated by ChEMBL
LigandPNGBDBM50511671(CHEMBL4566202)
Affinity DataIC50:  78nM. Assay description: Inhibition of recombinant human arginase 1 using L-arginine as substrate measured after 60 mins in presence of manganese chloride by o-phthaldialdehy...
Ligand InfoPC cidPC sid
In DepthDetails ArticlePubMed