BDBM50512634 CHEMBL4552592
SMILES COc1cc2c(NC3CCN(CC3)C(C)C)nc(nc2cc1C#CCN1CCCC1=O)C1CCCCC1
InChI Key InChIKey=YTZXLVDHUCDBOG-UHFFFAOYSA-N
Data  2 IC50
  Tab Delimited (TSV)   2D SDfile   Computed 3D by Vconf -m prep SDfile
Find this compound or compounds like it in BindingDB:
Activity Spreadsheet -- Enzyme Inhibition Constant Data from BindingDB
Found 2 hits for monomerid = 50512634
TargetHistone-lysine N-methyltransferase EHMT1(Homo sapiens (Human))
Mercachem
Curated by ChEMBL
LigandPNGBDBM50512634(CHEMBL4552592)
Affinity DataIC50:  27nM. Assay description: Inhibition of N-terminal GST tagged human recombinant EHMT1 (794 to 1294 residues) expressed in baculovirus infected Sf9 insect cells assessed as red...
Ligand InfoPC cidPC sid
In DepthDetails ArticlePubMed
TargetHistone-lysine N-methyltransferase EHMT2(Homo sapiens (Human))
Mercachem
Curated by ChEMBL
LigandPNGBDBM50512634(CHEMBL4552592)
Affinity DataIC50:  338nM. Assay description: Inhibition of N-terminal GST tagged human recombinant EHMT2 (785 to 1210 residues) expressed in baculovirus infected Sf9 insect cells assessed as red...
Ligand InfoPC cidPC sid
In DepthDetails ArticlePubMed