BDBM50514383 CHEMBL4554946
SMILES CCc1cccc(CC)c1-n1c2nc(c(Cl)cc2c(nc1=O)N1CCN(C[C@@H]1C)C(=O)C=C)-c1c(O)cccc1F
InChI Key InChIKey=WZMJTXKQKSEIAN-SFHVURJKSA-N
Data  2 IC50
  Tab Delimited (TSV)   2D SDfile   Computed 3D by Vconf -m prep SDfile
Find this compound or compounds like it in BindingDB:
Activity Spreadsheet -- Enzyme Inhibition Constant Data from BindingDB
Found 2 hits for monomerid = 50514383
TargetGTPase KRas(Homo sapiens (Human))
TBA
Curated by ChEMBL
LigandPNGBDBM50514383(CHEMBL4554946)
Affinity DataIC50:  36nM. Assay description: Inhibition of KRAS in human MIAPaca2 cells assessed as decrease in EGF-stimulated ERK1/2 phosphorylation preincubated for 2 hrs followed by EGF stimu...
Ligand InfoPC cidPC sid
In DepthDetails ArticlePubMed
TargetGTPase KRas(Homo sapiens (Human))
TBA
Curated by ChEMBL
LigandPNGBDBM50514383(CHEMBL4554946)
Affinity DataIC50:  68nM. Assay description: Inhibition of GDP bound recombinant human His-tagged KRAS G12C/C118A mutant (1 to 169 residues) assessed as reduction in SOS1-mediated GDP/GTP nucleo...
Ligand InfoPC cidPC sid
In DepthDetails ArticlePubMed