BDBM50514660 Dcfpyl::US10894807, ID P002
SMILES OC(=O)CC[C@H](NC(=O)N[C@@H](CCCCNC(=O)c1ccc(F)nc1)C(O)=O)C(O)=O
InChI Key InChIKey=OLWVRJUNLXQDSP-RYUDHWBXSA-N
Data  1 KI  1 IC50
  Tab Delimited (TSV)   2D SDfile   Computed 3D by Vconf -m prep SDfile
Find this compound or compounds like it in BindingDB:
Activity Spreadsheet -- Enzyme Inhibition Constant Data from BindingDB
Found 2 hits for monomerid = 50514660
TargetGlutamate carboxypeptidase 2(Homo sapiens (Human))
Siemens Medical Solutions Usa
US Patent
LigandPNGBDBM50514660(Dcfpyl | US10894807, ID P002)
Affinity DataKi:  15.6nM. Assay description: The inhibitory activity of all compounds was determined using a fluorescent assay of human PSMA activity. The enzyme used in the assay was purchased ...
In DepthDetails US Patent
TargetGlutamate carboxypeptidase 2(Homo sapiens (Human))
Siemens Medical Solutions Usa
US Patent
LigandPNGBDBM50514660(Dcfpyl | US10894807, ID P002)
Affinity DataIC50:  1.60nM. Assay description: Inhibition of PSMA in human LNCaP cell extracts in presence of N-acetylaspartylglutamate by Amplex red glutamic acid dependent fluorescence-based NAA...
In DepthDetails ArticlePubMed