BDBM50514879 CHEMBL4461164
SMILES C[C@H]1CCN(C1)S(=O)(=O)c1cc(NC(=O)Cn2nnc3CN(CCc23)C(C)=O)ccc1Br
InChI Key InChIKey=ZTDIVGGUCXGNOZ-ZDUSSCGKSA-N
Data  3 IC50
  Tab Delimited (TSV)   2D SDfile   Computed 3D by Vconf -m prep SDfile
Find this compound or compounds like it in BindingDB:
Activity Spreadsheet -- Enzyme Inhibition Constant Data from BindingDB
Found 3 hits for monomerid = 50514879
TargetATPase family AAA domain-containing protein 2(Homo sapiens (Human))
University Of Strathclyde
Curated by ChEMBL
LigandPNGBDBM50514879(CHEMBL4461164)
Affinity DataIC50:  1.59E+3nM. Assay description: Displacement of Alexa Fluor 488-labeled ligand from FLAG-6His-Tev-fused ATAD2 (981 to 1121 residue) (unknown origin) measured after 30 mins by TR-FRE...
Ligand InfoPC cidPC sid
In DepthDetails ArticlePubMed
TargetChromatin remodeling regulator CECR2(Homo sapiens (Human))
University Of Strathclyde
Curated by ChEMBL
LigandPNGBDBM50514879(CHEMBL4461164)
Affinity DataIC50:  100nM. Assay description: Displacement of Alexa Fluor 647-labeled GSK tracer from FLAG-6His-Tev-fused CECR2 (424 to 543 residue) (unknown origin) measured after 15 mins by TR-...
Ligand InfoPC cidPC sid
In DepthDetails ArticlePubMed
TargetBromodomain-containing protein 4(Homo sapiens (Human))
University Of Strathclyde
Curated by ChEMBL
LigandPNGBDBM50514879(CHEMBL4461164)
Affinity DataIC50: <5.01E+4nM. Assay description: Displacement of Alexa Fluor 647-labeled ligand from BRD4 BD1 Y390A mutant (1 to 477 residue) (unknown origin) measured after 30 mins by TR-FRET assay
Ligand InfoPC cidPC sid
In DepthDetails ArticlePubMed