BDBM50514896 CHEMBL4514362
SMILES CC(C)N1CCc2c(C1)nnn2CC(=O)Nc1ccc(Br)c(c1)S(=O)(=O)N1CC[C@H](C)C1
InChI Key InChIKey=KPFPCYXIJPOUES-HNNXBMFYSA-N
Data  3 IC50
  Tab Delimited (TSV)   2D SDfile   Computed 3D by Vconf -m prep SDfile
Find this compound or compounds like it in BindingDB:
Activity Spreadsheet -- Enzyme Inhibition Constant Data from BindingDB
Found 3 hits for monomerid = 50514896
TargetBromodomain-containing protein 4(Homo sapiens (Human))
University Of Strathclyde
Curated by ChEMBL
LigandPNGBDBM50514896(CHEMBL4514362)
Affinity DataIC50:  5.01E+4nM. Assay description: Displacement of Alexa Fluor 647-labeled ligand from BRD4 BD1 Y390A mutant (1 to 477 residue) (unknown origin) measured after 30 mins by TR-FRET assay
Ligand InfoPC cidPC sid
In DepthDetails ArticlePubMed
TargetChromatin remodeling regulator CECR2(Homo sapiens (Human))
University Of Strathclyde
Curated by ChEMBL
LigandPNGBDBM50514896(CHEMBL4514362)
Affinity DataIC50:  32nM. Assay description: Displacement of Alexa Fluor 647-labeled GSK tracer from FLAG-6His-Tev-fused CECR2 (424 to 543 residue) (unknown origin) measured after 15 mins by TR-...
Ligand InfoPC cidPC sid
In DepthDetails ArticlePubMed
TargetATPase family AAA domain-containing protein 2(Homo sapiens (Human))
University Of Strathclyde
Curated by ChEMBL
LigandPNGBDBM50514896(CHEMBL4514362)
Affinity DataIC50:  2.00E+3nM. Assay description: Displacement of Alexa Fluor 488-labeled ligand from FLAG-6His-Tev-fused ATAD2 (981 to 1121 residue) (unknown origin) measured after 30 mins by TR-FRE...
Ligand InfoPC cidPC sid
In DepthDetails ArticlePubMed