BDBM50515445 CHEMBL4453509
SMILES Oc1c(F)c(F)cc(C(=O)c2ccc(s2)-c2ccc(NS(=O)(=O)c3ccc(Cl)nc3)cc2)c1F
InChI Key InChIKey=FBJGDDQSQUOPNR-UHFFFAOYSA-N
Data  3 IC50
  Tab Delimited (TSV)   2D SDfile   Computed 3D by Vconf -m prep SDfile
Find this compound or compounds like it in BindingDB:
Activity Spreadsheet -- Enzyme Inhibition Constant Data from BindingDB
Found 3 hits for monomerid = 50515445
Target17-beta-hydroxysteroid dehydrogenase type 2(Homo sapiens (Human))
Elexopharm
Curated by ChEMBL
LigandPNGBDBM50515445(CHEMBL4453509)
Affinity DataIC50:  8.5nM. Assay description: Inhibition of human placental microsomal fraction 17beta-HSD2 using [3H]-E2 as substrate in presence of NAD+ by radio-HPLC analysis
Ligand InfoPC cidPC sid
In DepthDetails ArticlePubMed
TargetEstradiol 17-beta-dehydrogenase 2(Mus musculus)
Elexopharm
Curated by ChEMBL
LigandPNGBDBM50515445(CHEMBL4453509)
Affinity DataIC50:  44nM. Assay description: Inhibition of mouse liver homogenate 17beta-HSD2 using [3H]-E2 as substrate in presence of NAD+ by radio-HPLC analysis
Ligand InfoPC cidPC sid
In DepthDetails ArticlePubMed
Target17-beta-hydroxysteroid dehydrogenase type 1(Homo sapiens (Human))
Elexopharm
Curated by ChEMBL
LigandPNGBDBM50515445(CHEMBL4453509)
Affinity DataIC50:  170nM. Assay description: Inhibition of human placental cytosolic fraction 17beta-HSD1 using [3H]-E1 as substrate in presence of NAD+ by radio-HPLC analysis
Ligand InfoPC cidPC sid
In DepthDetails ArticlePubMed