BDBM50515599 CHEMBL4457426
SMILES COc1cc(\C=C\C(=O)NCCN2CCC(CCC(=O)c3cc(Cl)c(N)cc3OC)CC2)ccc1O
InChI Key InChIKey=GRSPTEBOWFGVCL-VMPITWQZSA-N
Data  1 KI  1 IC50  1 EC50
  Tab Delimited (TSV)   2D SDfile   Computed 3D by Vconf -m prep SDfile
Find this compound or compounds like it in BindingDB:
Activity Spreadsheet -- Enzyme Inhibition Constant Data from BindingDB
Found 3 hits for monomerid = 50515599
Target5-hydroxytryptamine receptor 4(Homo sapiens (Human))
Normandie Univ
Curated by ChEMBL
LigandPNGBDBM50515599(CHEMBL4457426)
Affinity DataKi:  101nM. Assay description: Binding affinity to recombinant human brain 5HT4 receptor by radio ligand binding assay
Ligand InfoPC cidPC sid
In DepthDetails ArticlePubMed
Target5-hydroxytryptamine receptor 4(Homo sapiens (Human))
Normandie Univ
Curated by ChEMBL
LigandPNGBDBM50515599(CHEMBL4457426)
Affinity DataEC50:  4.5nM. Assay description: Partial agonist activity at human HA-tagged 5HT4 receptor expressed in COS7 cells assessed as induction of cAMP production measured after 10 mins by ...
Ligand InfoPC cidPC sid
In DepthDetails ArticlePubMed
Target5-hydroxytryptamine receptor 4(Homo sapiens (Human))
Normandie Univ
Curated by ChEMBL
LigandPNGBDBM50515599(CHEMBL4457426)
Affinity DataIC50:  101nM. Assay description: Displacement of [3H]-GR 113808 from recombinant human brain 5HT4 receptor measured after 60 mins by radio ligand binding assay
Ligand InfoPC cidPC sid
In DepthDetails ArticlePubMed