BDBM50515914 CHEMBL4590713
SMILES Brc1ccc2oc(=O)n(CC(=O)c3ccc4ccccc4c3)c2c1
InChI Key InChIKey=BUJXBVBCJPCOGF-UHFFFAOYSA-N
Data  4 Kd
  Tab Delimited (TSV)   2D SDfile   Computed 3D by Vconf -m prep SDfile
Find this compound or compounds like it in BindingDB:
Activity Spreadsheet -- Enzyme Inhibition Constant Data from BindingDB
Found 4 hits for monomerid = 50515914
TargetTestis-specific chromodomain protein Y 1(Homo sapiens (Human))
Peking University
Curated by ChEMBL
LigandPNGBDBM50515914(CHEMBL4590713)
Affinity DataKd:  1.48E+4nM. Assay description: Binding affinity to recombinant human N-terminal GST-tagged CDY1 (1 to 65 residues) expressed in Escherichia coli BL2 by SPR analysis
Ligand InfoPC cidPC sid
In DepthDetails ArticlePubMed
TargetChromobox protein homolog 7(Homo sapiens (Human))
Peking University
Curated by ChEMBL
LigandPNGBDBM50515914(CHEMBL4590713)
Affinity DataKd:  9.50E+3nM. Assay description: Binding affinity to recombinant human N-terminal GST-tagged CBX7 (1 to 62 residues) expressed in Escherichia coli BL2 by SPR analysis
Ligand InfoPC cidPC sid
In DepthDetails ArticlePubMed
TargetChromodomain Y-like protein(Homo sapiens (Human))
Peking University
Curated by ChEMBL
LigandPNGBDBM50515914(CHEMBL4590713)
Affinity DataKd:  5.80E+3nM. Assay description: Binding affinity to recombinant human N-terminal GST-tagged CDYL (1 to 60 residues) expressed in Escherichia coli BL2 by SPR analysis
Ligand InfoPC cidPC sid
In DepthDetails ArticlePubMed
TargetChromodomain Y-like protein 2(Homo sapiens (Human))
Peking University
Curated by ChEMBL
LigandPNGBDBM50515914(CHEMBL4590713)
Affinity DataKd:  600nM. Assay description: Binding affinity to recombinant human N-terminal GST-tagged CDYL2 (1 to 70 residues) expressed in Escherichia coli BL2 by SPR analysis
Ligand InfoPC cidPC sid
In DepthDetails ArticlePubMed