BDBM50515920 CHEMBL4588523
SMILES CN1C(=O)C(O)(CC(=O)c2cccc3ccccc23)c2ccccc12
InChI Key InChIKey=GLVCUQWRRXRKMN-UHFFFAOYSA-N
Data  4 Kd
  Tab Delimited (TSV)   2D SDfile   Computed 3D by Vconf -m prep SDfile
Find this compound or compounds like it in BindingDB:
Activity Spreadsheet -- Enzyme Inhibition Constant Data from BindingDB
Found 4 hits for monomerid = 50515920
TargetChromobox protein homolog 7(Homo sapiens (Human))
Peking University
Curated by ChEMBL
LigandPNGBDBM50515920(CHEMBL4588523)
Affinity DataKd:  2.40E+3nM. Assay description: Binding affinity to recombinant human N-terminal GST-tagged CBX7 (1 to 62 residues) expressed in Escherichia coli BL2 by SPR analysis
In DepthDetails ArticlePubMed
TargetChromodomain Y-like protein(Homo sapiens (Human))
Peking University
Curated by ChEMBL
LigandPNGBDBM50515920(CHEMBL4588523)
Affinity DataKd:  1.28E+5nM. Assay description: Binding affinity to recombinant human N-terminal GST-tagged CDYL (1 to 60 residues) expressed in Escherichia coli BL2 by SPR analysis
In DepthDetails ArticlePubMed
TargetTestis-specific chromodomain protein Y 1(Homo sapiens (Human))
Peking University
Curated by ChEMBL
LigandPNGBDBM50515920(CHEMBL4588523)
Affinity DataKd:  2.47E+4nM. Assay description: Binding affinity to recombinant human N-terminal GST-tagged CDY1 (1 to 65 residues) expressed in Escherichia coli BL2 by SPR analysis
In DepthDetails ArticlePubMed
TargetChromodomain Y-like protein 2(Homo sapiens (Human))
Peking University
Curated by ChEMBL
LigandPNGBDBM50515920(CHEMBL4588523)
Affinity DataKd: >2.00E+5nM. Assay description: Binding affinity to recombinant human N-terminal GST-tagged CDYL2 (1 to 70 residues) expressed in Escherichia coli BL2 by SPR analysis
In DepthDetails ArticlePubMed