BDBM50517064 CHEMBL4548954
SMILES COc1ccc(cc1)N1N=C(C)C(C(=O)Nc2cccc(c2)-c2ccco2)C1=O
InChI Key InChIKey=QZXYZEDIRMCFCW-UHFFFAOYSA-N
Data  1 IC50
  Tab Delimited (TSV)   2D SDfile   Computed 3D by Vconf -m prep SDfile
Find this compound or compounds like it in BindingDB:
Activity Spreadsheet -- Enzyme Inhibition Constant Data from BindingDB
Found 1 hit for monomerid = 50517064
TargetAcetyl-coenzyme A synthetase, cytoplasmic(Homo sapiens)
Usona Institute
Curated by ChEMBL
LigandPNGBDBM50517064(CHEMBL4548954)
Affinity DataIC50:  3.20nM. Assay description: Inhibition of ACSS2 in human MDA-MB-468 cells assessed as 13C-acetate incorporation incubated for 5 hrs measured under hypoxic conditions by LCMS ana...
Ligand InfoPC cidPC sid
In DepthDetails ArticlePubMed