BDBM50517065 CHEMBL4550594
SMILES CC1=NN(C(=O)C1C(=O)Nc1cccc(c1)C(C)(F)F)c1ccc(OC(F)F)c(c1)-c1cccnc1
InChI Key InChIKey=RGZWKAFHDGAPQJ-UHFFFAOYSA-N
Data  1 IC50
  Tab Delimited (TSV)   2D SDfile   Computed 3D by Vconf -m prep SDfile
Find this compound or compounds like it in BindingDB:
Activity Spreadsheet -- Enzyme Inhibition Constant Data from BindingDB
Found 1 hit for monomerid = 50517065
TargetAcetyl-coenzyme A synthetase, cytoplasmic(Homo sapiens)
Usona Institute
Curated by ChEMBL
LigandPNGBDBM50517065(CHEMBL4550594)
Affinity DataIC50:  0.330nM. Assay description: Inhibition of ACSS2 in human MDA-MB-468 cells assessed as 13C-acetate incorporation incubated for 5 hrs measured under hypoxic conditions by LCMS ana...
Ligand InfoPC cidPC sid
In DepthDetails ArticlePubMed