BDBM50517613 CHEMBL4549724
SMILES CC(C)C[C@H](NC(=O)[C@H](CC(C)C)NC(=O)c1ccc(nc1)-c1ccccc1)C(=O)N[C@@H](Cc1ccc(CN)cc1)\C=C\S(C)(=O)=O
InChI Key InChIKey=NDVPAPQGOZGJQP-DPSBBIDJSA-N
Data  2 IC50
  Tab Delimited (TSV)   2D SDfile   Computed 3D by Vconf -m prep SDfile
Find this compound or compounds like it in BindingDB:
Activity Spreadsheet -- Enzyme Inhibition Constant Data from BindingDB
Found 2 hits for monomerid = 50517613
TargetProteasome subunit beta type-2(Homo sapiens (Human))
Leiden Institute Of Chemistry And Netherlands Proteomics Centre
Curated by ChEMBL
LigandPNGBDBM50517613(CHEMBL4549724)
Affinity DataIC50:  29nM. Assay description: Inhibition of 20S constitutive proteasome beta 2 trypsin-like activity (unknown origin) by cell based ABPP assay
Ligand InfoPC cidPC sid
In DepthDetails ArticlePubMed
TargetProteasome subunit beta type-10(Homo sapiens (Human))
Leiden Institute Of Chemistry And Netherlands Proteomics Centre
Curated by ChEMBL
LigandPNGBDBM50517613(CHEMBL4549724)
Affinity DataIC50:  23nM. Assay description: Inhibition of 20S immunoproteasome beta 2 (unknown origin) by cell based ABPP assay
Ligand InfoPC cidPC sid
In DepthDetails ArticlePubMed