BDBM50517629 CHEMBL4446214
SMILES COc1ccc(C[C@H](NC(=O)[C@H](C)NC(=O)CN2CCOCC2)C(=O)N[C@@H](CC2CCCC3CCCCC23)C(=O)[C@@]2(C)CO2)cc1
InChI Key InChIKey=IJXUVRJYZJRYCL-BGPVXCRASA-N
Data  8 IC50
  Tab Delimited (TSV)   2D SDfile   Computed 3D by Vconf -m prep SDfile
Find this compound or compounds like it in BindingDB:
Activity Spreadsheet -- Enzyme Inhibition Constant Data from BindingDB
Found 8 hits for monomerid = 50517629
TargetProteasome subunit beta type-10(Homo sapiens (Human))
Leiden Institute Of Chemistry And Netherlands Proteomics Centre
Curated by ChEMBL
LigandPNGBDBM50517629(CHEMBL4446214)
Affinity DataIC50: >1.00E+4nM. Assay description: Inhibition of 20S immunoproteasome beta 2 (unknown origin) by cell based ABPP assay
Ligand InfoPC cidPC sid
In DepthDetails ArticlePubMed
TargetProteasome subunit beta type-10(Homo sapiens (Human))
Leiden Institute Of Chemistry And Netherlands Proteomics Centre
Curated by ChEMBL
LigandPNGBDBM50517629(CHEMBL4446214)
Affinity DataIC50:  180nM. Assay description: Inhibition of 20S immunoproteasome beta 2 in human Raji cell lysates after 1 hr by competitive ABPP assay
Ligand InfoPC cidPC sid
In DepthDetails ArticlePubMed
TargetProteasome subunit beta type-8(Homo sapiens (Human))
Leiden Institute Of Chemistry And Netherlands Proteomics Centre
Curated by ChEMBL
LigandPNGBDBM50517629(CHEMBL4446214)
Affinity DataIC50: >1.00E+5nM. Assay description: Inhibition of 20S immunoproteasome beta 5 in human Raji cell lysates after 1 hr by competitive ABPP assay
Ligand InfoPC cidPC sid
In DepthDetails ArticlePubMed
TargetProteasome subunit beta type-5(Homo sapiens (Human))
Leiden Institute Of Chemistry And Netherlands Proteomics Centre
Curated by ChEMBL
LigandPNGBDBM50517629(CHEMBL4446214)
Affinity DataIC50: >1.00E+5nM. Assay description: Inhibition of 20S constitutive proteasome beta 5 chymotrypsin-like activity in human Raji cell lysates after 1 hr by competitive ABPP assay
Ligand InfoPC cidPC sid
In DepthDetails ArticlePubMed
TargetProteasome subunit beta type-2(Homo sapiens (Human))
Leiden Institute Of Chemistry And Netherlands Proteomics Centre
Curated by ChEMBL
LigandPNGBDBM50517629(CHEMBL4446214)
Affinity DataIC50:  320nM. Assay description: Inhibition of 20S constitutive proteasome beta 2 trypsin-like activity (unknown origin) by cell based ABPP assay
Ligand InfoPC cidPC sid
In DepthDetails ArticlePubMed
TargetProteasome subunit beta type-9(Homo sapiens (Human))
Leiden Institute Of Chemistry And Netherlands Proteomics Centre
Curated by ChEMBL
LigandPNGBDBM50517629(CHEMBL4446214)
Affinity DataIC50: >1.00E+5nM. Assay description: Inhibition of 20S immunoproteasome beta 1 in human Raji cell lysates after 1 hr by competitive ABPP assay
Ligand InfoPC cidPC sid
In DepthDetails ArticlePubMed
TargetProteasome subunit beta type-2(Homo sapiens (Human))
Leiden Institute Of Chemistry And Netherlands Proteomics Centre
Curated by ChEMBL
LigandPNGBDBM50517629(CHEMBL4446214)
Affinity DataIC50:  1.21E+4nM. Assay description: Inhibition of 20S constitutive proteasome beta 2 trypsin-like activity in human Raji cell lysates after 1 hr by competitive ABPP assay
Ligand InfoPC cidPC sid
In DepthDetails ArticlePubMed
TargetProteasome subunit beta type-1(Homo sapiens (Human))
Leiden Institute Of Chemistry And Netherlands Proteomics Centre
Curated by ChEMBL
LigandPNGBDBM50517629(CHEMBL4446214)
Affinity DataIC50: >1.00E+5nM. Assay description: Inhibition of 20S constitutive proteasome beta 1 caspase-like activity in human Raji cell lysates after 1 hr by competitive ABPP assay
Ligand InfoPC cidPC sid
In DepthDetails ArticlePubMed