BDBM50518060 CHEMBL4455357
SMILES Cn1nc(cc1-c1cnc(nc1)N1CCc2cc(cc(N3CCCC3=O)c12)S(=O)(=O)Nc1c(F)cc(Cl)cc1F)C(F)(F)F
InChI Key InChIKey=VSZRYLHBOKTNBO-UHFFFAOYSA-N
Data  2 IC50
  Tab Delimited (TSV)   2D SDfile   Computed 3D by Vconf -m prep SDfile
Find this compound or compounds like it in BindingDB:
Activity Spreadsheet -- Enzyme Inhibition Constant Data from BindingDB
Found 2 hits for monomerid = 50518060
LigandPNGBDBM50518060(CHEMBL4455357)
Affinity DataIC50:  2.40nM. Assay description: Inhibition of recombinant mouse MGAT2
In DepthDetails ArticlePubMed
LigandPNGBDBM50518060(CHEMBL4455357)
Affinity DataIC50:  7.80nM. Assay description: Inhibition of recombinant human MGAT2
In DepthDetails ArticlePubMed