BDBM50518351 CHEMBL4470500
SMILES NC1=CC(N)=C2C=CC(=O)N=C2C1=O
InChI Key InChIKey=MNCJAIOYOIRYJW-UHFFFAOYSA-N
Data  3 IC50
  Tab Delimited (TSV)   2D SDfile   Computed 3D by Vconf -m prep SDfile
Find this compound or compounds like it in BindingDB:
Activity Spreadsheet -- Enzyme Inhibition Constant Data from BindingDB
Found 3 hits for monomerid = 50518351
TargetTyrosyl-DNA phosphodiesterase 2(Homo sapiens (Human))
University Of Minnesota
Curated by ChEMBL
LigandPNGBDBM50518351(CHEMBL4470500)
Affinity DataIC50:  40nM. Assay description: Inhibition of humanized zebrafish TDP2 using 5'-(6-FAM-NHS) as substrate preincubated for 10 mins followed by substrate addition and measured after 6...
Ligand InfoPC cidPC sid
In DepthDetails ArticlePubMed
TargetTyrosyl-DNA phosphodiesterase 2(Homo sapiens (Human))
University Of Minnesota
Curated by ChEMBL
LigandPNGBDBM50518351(CHEMBL4470500)
Affinity DataIC50:  2.00E+3nM. Assay description: Inhibition of TDP2 (unknown origin)
Ligand InfoPC cidPC sid
In DepthDetails ArticlePubMed
TargetTyrosyl-DNA phosphodiesterase 2(Homo sapiens (Human))
University Of Minnesota
Curated by ChEMBL
LigandPNGBDBM50518351(CHEMBL4470500)
Affinity DataIC50:  1.70E+3nM. Assay description: Inhibition of recombinant human TDP2 using T5PNP as substrate preincubated for 10 mins followed by substrate addition and measured after 30 mins
Ligand InfoPC cidPC sid
In DepthDetails ArticlePubMed