BDBM50518856 CHEMBL4466290::US10829446, Compound 31
SMILES O=C(NNS(=O)(=O)c1ccccc1)c1cccc(c1)-c1cccc(c1)C#N
InChI Key InChIKey=PELGKYNBWJWSFW-UHFFFAOYSA-N
Data  2 IC50
  Tab Delimited (TSV)   2D SDfile   Computed 3D by Vconf -m prep SDfile
Find this compound or compounds like it in BindingDB:
Activity Spreadsheet -- Enzyme Inhibition Constant Data from BindingDB
Found 2 hits for monomerid = 50518856
TargetHistone acetyltransferase KAT6A [507-778](Homo sapiens)
Monash University
US Patent
LigandPNGBDBM50518856(CHEMBL4466290 | US10829446, Compound 31)
Affinity DataIC50:  8.55E+3nM. Assay description: Active Moz protein was expressed as N-terminal fusion protein with a His6 tag in BL21 E. coli cells. Protein purification was performed via nickel-im...
Ligand InfoPC cidPC sid
In DepthDetails US Patent
TargetHistone acetyltransferase KAT6A [507-778](Homo sapiens)
Monash University
US Patent
LigandPNGBDBM50518856(CHEMBL4466290 | US10829446, Compound 31)
Affinity DataIC50:  3.40E+3nM. Assay description: Inhibition of N-terminal NusA-fused His6-tagged human KAT6A (507 to 778 residues) expressed in Escherichia coli BL21 (DE3) cells using 0.4 uM acetyl ...
Ligand InfoPC cidPC sid
In DepthDetails ArticlePubMed