BDBM50518969 CHEMBL4514723
SMILES CC(C)NC[C@H](O)COc1ccccc1CCCn1cc(CNCc2cn(CCCc3ccccc3OC[C@@H](O)CNC(C)C)nn2)nn1
InChI Key InChIKey=NBTZMFMFCAFRPY-HEVIKAOCSA-N
Data  2 KI  3 IC50
  Tab Delimited (TSV)   2D SDfile   Computed 3D by Vconf -m prep SDfile
Find this compound or compounds like it in BindingDB:
Activity Spreadsheet -- Enzyme Inhibition Constant Data from BindingDB
Found 5 hits for monomerid = 50518969
TargetBeta-2 adrenergic receptor(Homo sapiens (Human))
University Of Copenhagen
Curated by ChEMBL
LigandPNGBDBM50518969(CHEMBL4514723)
Affinity DataKi:  0.437nM. Assay description: Displacement of [3H]DHA from beta2 adrenergic receptor (unknown origin) stably expressed in HEK293 cell membranes measured after 90 mins by scintilla...
Ligand InfoPC cidPC sid
In DepthDetails ArticlePubMed
TargetBeta-1 adrenergic receptor(Homo sapiens (Human))
University Of Copenhagen
Curated by ChEMBL
LigandPNGBDBM50518969(CHEMBL4514723)
Affinity DataKi:  1.10nM. Assay description: Displacement of [3H]DHA from beta1 adrenergic receptor (unknown origin) stably expressed in HEK293 cell membranes measured after 90 mins by scintilla...
Ligand InfoPC cidPC sid
In DepthDetails ArticlePubMed
TargetBeta-1 adrenergic receptor(Homo sapiens (Human))
University Of Copenhagen
Curated by ChEMBL
LigandPNGBDBM50518969(CHEMBL4514723)
Affinity DataIC50:  4.70nM. Assay description: Antagonist activity at beta1 adrenergic receptor (unknown origin) stably expressed in HEK293 cell membranes assessed as inhibition of isoproterenol-i...
Ligand InfoPC cidPC sid
In DepthDetails ArticlePubMed
TargetBeta-2 adrenergic receptor(Homo sapiens (Human))
University Of Copenhagen
Curated by ChEMBL
LigandPNGBDBM50518969(CHEMBL4514723)
Affinity DataIC50:  2.90nM. Assay description: Antagonist activity at beta2 adrenergic receptor (unknown origin) stably expressed in HEK293 cell membranes assessed as inhibition of isoproterenol-i...
Ligand InfoPC cidPC sid
In DepthDetails ArticlePubMed
TargetBeta-2 adrenergic receptor(Homo sapiens (Human))
University Of Copenhagen
Curated by ChEMBL
LigandPNGBDBM50518969(CHEMBL4514723)
Affinity DataIC50:  1.20nM. Assay description: Antagonist activity at beta2 adrenergic receptor (unknown origin) expressed in HEK293 cell assessed as inhibition of isoproterenol-induced cAMP produ...
Ligand InfoPC cidPC sid
In DepthDetails ArticlePubMed