BDBM50519343 CHEMBL4572363
SMILES OC(c1ccn(n1)C(=O)N1CCCC[C@@H]1Cc1ccccc1)(c1ccc(F)cc1)c1ccc(F)cc1
InChI Key InChIKey=KFEJEEXFFSNLHM-AREMUKBSSA-N
Data  1 KI  2 IC50
  Tab Delimited (TSV)   2D SDfile   Computed 3D by Vconf -m prep SDfile
Find this compound or compounds like it in BindingDB:
Activity Spreadsheet -- Enzyme Inhibition Constant Data from BindingDB
Found 3 hits for monomerid = 50519343
TargetDiacylglycerol lipase-alpha(Mus musculus)
Leiden University
Curated by ChEMBL
LigandPNGBDBM50519343(CHEMBL4572363)
Affinity DataKi:  1.08E+4nM. Assay description: Inhibition of mouse DAGL-alpha expressed in HEK293T cell membranes assessed as inhibition constant pre-incubated for 20 mins before PNP-butyrate subs...
Ligand InfoPC cidPC sid
In DepthDetails ArticlePubMed
TargetDiacylglycerol lipase-alpha(Mus musculus)
Leiden University
Curated by ChEMBL
LigandPNGBDBM50519343(CHEMBL4572363)
Affinity DataIC50:  210nM. Assay description: Inhibition of mouse DAGL-alpha expressed in HEK293T cell membranes pre-incubated for 20 mins before PNP-butyrate substrate addition and measured afte...
Ligand InfoPC cidPC sid
In DepthDetails ArticlePubMed
TargetDiacylglycerol lipase-alpha(Mus musculus)
Leiden University
Curated by ChEMBL
LigandPNGBDBM50519343(CHEMBL4572363)
Affinity DataIC50:  209nM. Assay description: Inhibition of mouse DAGL-alpha expressed in HEK293T cell membranes pre-incubated for 20 mins before PNP-butyrate substrate addition and measured afte...
Ligand InfoPC cidPC sid
In DepthDetails ArticlePubMed