BDBM50519588 CHEMBL4584584
SMILES COc1cc(cnc1C(=O)[C@H]1C[C@@H]1C(O)=O)N(CC(C)(C)F)c1cc(ccc1F)C(F)(F)F
InChI Key InChIKey=OJQDKIBGNLANTD-KBPBESRZSA-N
Data  2 IC50
  Tab Delimited (TSV)   2D SDfile   Computed 3D by Vconf -m prep SDfile
Find this compound or compounds like it in BindingDB:
Activity Spreadsheet -- Enzyme Inhibition Constant Data from BindingDB
Found 2 hits for monomerid = 50519588
TargetLeukotriene C4 synthase(Homo sapiens (Human))
Orexo
Curated by ChEMBL
LigandPNGBDBM50519588(CHEMBL4584584)
Affinity DataIC50:  0.630nM. Assay description: Inhibition of human N-terminal His6-tagged LTC4S expressed in Pichia pastoris X33 using LTA4 methyl ester and glutathione as substrate preincubated f...
Ligand InfoPC cidPC sid
In DepthDetails ArticlePubMed
TargetLeukotriene C4 synthase(Homo sapiens (Human))
Orexo
Curated by ChEMBL
LigandPNGBDBM50519588(CHEMBL4584584)
Affinity DataIC50:  31nM. Assay description: Inhibition of LTC4S in zymosan-stimulated human PBMC assessed as inhibition of LTC4 production preincubated for 45 mins followed by zymosan stimulati...
Ligand InfoPC cidPC sid
In DepthDetails ArticlePubMed