BDBM50520148 CHEMBL4538751::US10894784, Example 30.03.01.A
SMILES C[C@@H](N1CCN(CC1)C(=O)CC(F)(F)F)c1ccnc(Nc2nc3ccc(cc3[nH]2)-c2cc(C)ncn2)c1
InChI Key InChIKey=HGCJKDOLUCMPFE-QGZVFWFLSA-N
Data  9 IC50
  Tab Delimited (TSV)   2D SDfile   Computed 3D by Vconf -m prep SDfile
Find this compound or compounds like it in BindingDB:
Activity Spreadsheet -- Enzyme Inhibition Constant Data from BindingDB
Found 9 hits for monomerid = 50520148
TargetCyclin-T1/Cyclin-dependent kinase 9(Homo sapiens (Human))
Bayer
Curated by ChEMBL
LigandPNGBDBM50520148(CHEMBL4538751 | US10894784, Example 30.03.01.A)
Affinity DataIC50:  2.13E+3nM. Assay description: Inhibition of recombinant full length human His-tagged CDK9/CyclinT1 expressed in baculovirus expression system using biotin-labelled Ttds-YISPLKSPYK...
Ligand InfoPC cidPC sid
In DepthDetails ArticlePubMed
LigandPNGBDBM50520148(CHEMBL4538751 | US10894784, Example 30.03.01.A)
Affinity DataIC50:  140nM. Assay description: Inhibition of IKKepsilon/TBK1 in human MDB-MB-231 cells transduced with lentiviral vector expressing human IRF3 assessed as decrease in poly(I:C)-sti...
Ligand InfoPC cidPC sid
In DepthDetails ArticlePubMed
TargetSerine/threonine-protein kinase TBK1(Homo sapiens (Human))
Bayer
Curated by ChEMBL
LigandPNGBDBM50520148(CHEMBL4538751 | US10894784, Example 30.03.01.A)
Affinity DataIC50:  17nM. Assay description: Inhibition of recombinant full length human N-terminal His-tagged TBK1 using biotin-labelled Ahx-GDEDFSSFAEPG peptide as substrate preincubated with ...
Ligand InfoPC cidPC sid
In DepthDetails ArticlePubMed
TargetInhibitor of nuclear factor kappa-B kinase subunit epsilon(Homo sapiens (Human))
Bayer
Curated by ChEMBL
LigandPNGBDBM50520148(CHEMBL4538751 | US10894784, Example 30.03.01.A)
Affinity DataIC50:  4nM. Assay description: Inhibition of recombinant full length human C-terminal GST-tagged IKKepsilon expressed in baculovirus expression system using biotin-labelled Ahx-GDE...
Ligand InfoPC cidPC sid
In DepthDetails ArticlePubMed
TargetSerine/threonine-protein kinase TBK1(Homo sapiens (Human))
Bayer
Curated by ChEMBL
LigandPNGBDBM50520148(CHEMBL4538751 | US10894784, Example 30.03.01.A)
Affinity DataIC50:  18nM. Assay description: Recombinant full-length N-terminally His-tagged human TBK1, expressed in insect cells and purified by Ni-NTA affinity chromatography, was purchased f...
Ligand InfoPC cidPC sid
In DepthDetails US Patent
TargetRibosomal protein S6 kinase alpha-6(Homo sapiens (Human))
Bayer
Curated by ChEMBL
LigandPNGBDBM50520148(CHEMBL4538751 | US10894784, Example 30.03.01.A)
Affinity DataIC50:  170nM. Assay description: Inhibition of recombinant full length human His6-tagged RSK4 expressed in baculovirus infected sf21 cells using biotin labelled Ahx-KKLNRTLSFAEPG pep...
Ligand InfoPC cidPC sid
In DepthDetails ArticlePubMed
TargetSerine/threonine-protein kinase ULK1(Homo sapiens (Human))
Bayer
Curated by ChEMBL
LigandPNGBDBM50520148(CHEMBL4538751 | US10894784, Example 30.03.01.A)
Affinity DataIC50:  980nM. Assay description: Inhibition of wild-type human partial length ULK1 (M1 to T309 residues) expressed in mammalian expression system by Kinomescan method
Ligand InfoPC cidPC sid
In DepthDetails ArticlePubMed
TargetSerine/threonine-protein kinase TBK1(Homo sapiens (Human))
Bayer
Curated by ChEMBL
LigandPNGBDBM50520148(CHEMBL4538751 | US10894784, Example 30.03.01.A)
Affinity DataIC50:  2nM. Assay description: Inhibition of recombinant full length human N-terminal His-tagged TBK1 using biotin-labelled Ahx-GDEDFSSFAEPG peptide as substrate preincubated with ...
Ligand InfoPC cidPC sid
In DepthDetails ArticlePubMed
TargetReceptor-type tyrosine-protein kinase FLT3(Homo sapiens (Human))
Bayer
Curated by ChEMBL
LigandPNGBDBM50520148(CHEMBL4538751 | US10894784, Example 30.03.01.A)
Affinity DataIC50:  10nM. Assay description: Inhibition of recombinant human N-terminal GST-tagged FLT3 (564 to end residues) expressed in sf21 cells using biotin labelled Ahx-GGEEEEYFELVKKKK pe...
Ligand InfoPC cidPC sid
In DepthDetails ArticlePubMed