BDBM50520711 CHEMBL4579917
SMILES Clc1cccc(CC2(COc3ccncc3)CCCNC2)c1
InChI Key InChIKey=NIOWNQMDKDMUGQ-UHFFFAOYSA-N
Data  1 KI
  Tab Delimited (TSV)   2D SDfile   Computed 3D by Vconf -m prep SDfile
Find this compound or compounds like it in BindingDB:
Activity Spreadsheet -- Enzyme Inhibition Constant Data from BindingDB
Found 1 hit for monomerid = 50520711
TargetAcetylcholine-binding protein(Lymnaea stagnalis)
Fudan University
Curated by ChEMBL
LigandPNGBDBM50520711(CHEMBL4579917)
Affinity DataKi:  17nM. Assay description: Displacement of [3H]epibatidine from Lymnaea stagnalis acetylcholine-binding protein incubated for 60 mins followed by 3 hrs incubation in dark condi...
Ligand InfoPC cidPC sid
In DepthDetails ArticlePubMed