BDBM50523526 CHEMBL3606064
SMILES O[C@H]1[C@@H](O)[C@@H](O[C@@H]1COP(O)(=O)CP(O)(O)=O)n1cc(F)c(=O)[nH]c1=O
InChI Key InChIKey=UTTXPVADCDYRBS-JXOAFFINSA-N
Data  4 KI  3 IC50  3 EC50
  Tab Delimited (TSV)   2D SDfile   Computed 3D by Vconf -m prep SDfile
Find this compound or compounds like it in BindingDB:
Activity Spreadsheet -- Enzyme Inhibition Constant Data from BindingDB
Found 10 hits for monomerid = 50523526
Target5'-nucleotidase(Homo sapiens (Human))
National Institute Of Diabetes And Digestive And Kidney Diseases
Curated by ChEMBL
LigandPNGBDBM50523526(CHEMBL3606064)
Affinity DataKi:  4.5nM. Assay description: Inhibition of CD73 in human MDA-MB-231 cell membranes using [2,8-3H]AMP as substrate measured after 25 mins by scintillation counting method
Ligand InfoPC cidPC sid
In DepthDetails ArticlePubMed
Target5'-nucleotidase(Homo sapiens (Human))
National Institute Of Diabetes And Digestive And Kidney Diseases
Curated by ChEMBL
LigandPNGBDBM50523526(CHEMBL3606064)
Affinity DataKi:  5.30nM. Assay description: Inhibition of recombinant human C-terminal His-tagged soluble form of CD73 expressed in baculovirus infected Sf9 insect cells using [2,8-3H]AMP as su...
Ligand InfoPC cidPC sid
In DepthDetails ArticlePubMed
Target5'-nucleotidase(Rattus norvegicus (Rat))
National Institute Of Diabetes And Digestive And Kidney Diseases
Curated by ChEMBL
LigandPNGBDBM50523526(CHEMBL3606064)
Affinity DataKi:  15nM. Assay description: Inhibition of recombinant rat C-terminal His-tagged soluble form of CD73 expressed in baculovirus infected Sf9 insect cells using [2,8-3H]AMP as subs...
Ligand InfoPC cidPC sid
In DepthDetails ArticlePubMed
Target5'-nucleotidase(Homo sapiens (Human))
National Institute Of Diabetes And Digestive And Kidney Diseases
Curated by ChEMBL
LigandPNGBDBM50523526(CHEMBL3606064)
Affinity DataKi:  2.54E+3nM. Assay description: Inhibition of human soluble CD73 assessed as inhibition constant
Ligand InfoPC cidPC sid
In DepthDetails ArticlePubMed
TargetP2Y purinoceptor 6(Homo sapiens (Human))
National Institute Of Diabetes And Digestive And Kidney Diseases
Curated by ChEMBL
LigandPNGBDBM50523526(CHEMBL3606064)
Affinity DataEC50:  203nM. Assay description: Agonist activity at human P2Y6R expressed in 1321N1 cells assessed as calcium mobilization measured by FLIPR method
Ligand InfoPC cidPC sid
In DepthDetails ArticlePubMed
Target5'-nucleotidase(Rattus norvegicus (Rat))
National Institute Of Diabetes And Digestive And Kidney Diseases
Curated by ChEMBL
LigandPNGBDBM50523526(CHEMBL3606064)
Affinity DataIC50: >1.00E+3nM. Assay description: Inhibition of rat CD73 using [3H]-AMP as substrate by radiometric assay
Ligand InfoPC cidPC sid
In DepthDetails ArticlePubMed
TargetP2Y purinoceptor 14(Homo sapiens (Human))
National Institute Of Diabetes And Digestive And Kidney Diseases
Curated by ChEMBL
LigandPNGBDBM50523526(CHEMBL3606064)
Affinity DataIC50:  362nM. Assay description: Binding affinity to human P2Y14 expressed in CHO cells
Ligand InfoPC cidPC sid
In DepthDetails ArticlePubMed
TargetP2Y purinoceptor 14(Homo sapiens (Human))
National Institute Of Diabetes And Digestive And Kidney Diseases
Curated by ChEMBL
LigandPNGBDBM50523526(CHEMBL3606064)
Affinity DataIC50:  362nM. Assay description: Displacement of 6-Amino-9-(2-carboxy-4-((6-(4-(4-(4-(4-(3-carboxy-6-(4-(trifluoromethyl)phenyl)-naphthalen-1-yl)phenyl)piperidin-1-yl)butyl)-1H-1,2,3...
Ligand InfoPC cidPC sid
In DepthDetails ArticlePubMed
TargetP2Y purinoceptor 6(Homo sapiens (Human))
National Institute Of Diabetes And Digestive And Kidney Diseases
Curated by ChEMBL
LigandPNGBDBM50523526(CHEMBL3606064)
Affinity DataEC50:  203nM. Assay description: Agonist activity at human P2Y6 receptor expressed in human 1321N1 cells assessed as induction of calcium mobilization by calcium-4 dye based FLIPR as...
Ligand InfoPC cidPC sid
In DepthDetails ArticlePubMed
TargetP2Y purinoceptor 6(Homo sapiens (Human))
National Institute Of Diabetes And Digestive And Kidney Diseases
Curated by ChEMBL
LigandPNGBDBM50523526(CHEMBL3606064)
Affinity DataEC50:  203nM. Assay description: Agonist activity at human P2Y6R expressed in 1321N1 cells assessed as calcium mobilization measured by microplate reader method
Ligand InfoPC cidPC sid
In DepthDetails ArticlePubMed