BDBM50523529 CHEMBL4551648
SMILES O[C@H]1C[C@@H](O[C@@H]1COP(O)(=O)CP(O)(O)=O)n1cc\c(=N/OCc2ccc(cc2)C(F)(F)F)[nH]c1=O
InChI Key InChIKey=WHOLNPIFCSITAA-SQWLQELKSA-N
Data  3 KI
  Tab Delimited (TSV)   2D SDfile   Computed 3D by Vconf -m prep SDfile
Find this compound or compounds like it in BindingDB:
Activity Spreadsheet -- Enzyme Inhibition Constant Data from BindingDB
Found 3 hits for monomerid = 50523529
Target5'-nucleotidase(Homo sapiens (Human))
National Institute Of Diabetes And Digestive And Kidney Diseases
Curated by ChEMBL
LigandPNGBDBM50523529(CHEMBL4551648)
Affinity DataKi:  10nM. Assay description: Inhibition of CD73 in human MDA-MB-231 cell membranes using [2,8-3H]AMP as substrate measured after 25 mins by scintillation counting method
Ligand InfoPC cidPC sid
In DepthDetails ArticlePubMed
Target5'-nucleotidase(Homo sapiens (Human))
National Institute Of Diabetes And Digestive And Kidney Diseases
Curated by ChEMBL
LigandPNGBDBM50523529(CHEMBL4551648)
Affinity DataKi:  14nM. Assay description: Inhibition of recombinant human C-terminal His-tagged soluble form of CD73 expressed in baculovirus infected Sf9 insect cells using [2,8-3H]AMP as su...
Ligand InfoPC cidPC sid
In DepthDetails ArticlePubMed
Target5'-nucleotidase(Rattus norvegicus (Rat))
National Institute Of Diabetes And Digestive And Kidney Diseases
Curated by ChEMBL
LigandPNGBDBM50523529(CHEMBL4551648)
Affinity DataKi:  30nM. Assay description: Inhibition of recombinant rat C-terminal His-tagged soluble form of CD73 expressed in baculovirus infected Sf9 insect cells using [2,8-3H]AMP as subs...
Ligand InfoPC cidPC sid
In DepthDetails ArticlePubMed